Reaction Details
TargetD(2) dopamine receptor
LigandBDBM185681
Substrate/Competitorn/a
Meas. Tech.cAMP GloSensor Assay
pH7.4±n/a
EC50 222±n/a nM
Commentsextracted
Citation Jin, JRoth, BFrye, S Functionally selective ligands of dopamine D2 receptors US Patent US9156822 Publication Date 10/13/2015
 
D(2) dopamine receptor
Name:D(2) dopamine receptor
Type:Cell-surface receptors
Mol. Mass.:50647.10
Organism:Homo sapiens (Human)
Description:P14416
Residue:443
BDBM185681
NameBDBM185681
Synonyms:UNC10107955 | US9156822, 11
TypeSmall organic molecule
Emp. Form.C24H32N4O3
Mol. Mass.424.5359
SMILESCOc1ccccc1N1CCCN(CCCCOc2ccc3CCC(=O)Nc3n2)CC1