Reaction Details
TargetD(2) dopamine receptor
LigandBDBM185693
Substrate/Competitorn/a
Meas. Tech.cAMP GloSensor Assay
pH7.4±n/a
EC50 512±n/a nM
Commentsextracted
Citation Jin, JRoth, BFrye, S Functionally selective ligands of dopamine D2 receptors US Patent US9156822 Publication Date 10/13/2015
 
D(2) dopamine receptor
Name:D(2) dopamine receptor
Type:Cell-surface receptors
Mol. Mass.:50647.10
Organism:Homo sapiens (Human)
Description:P14416
Residue:443
BDBM185693
NameBDBM185693
Synonyms:UNC10099988 | US9156822, 34
TypeSmall organic molecule
Emp. Form.C20H22Cl2N4O2
Mol. Mass.421.32
SMILESClc1cccc(N2CCN(CCCOc3ccc4[nH]c(=O)[nH]c4c3)CC2)c1Cl