Reaction Details
TargetD(2) dopamine receptor
LigandBDBM185697
Substrate/Competitorn/a
Meas. Tech.cAMP GloSensor Assay
pH7.4±n/a
EC50 0.4±n/a nM
Commentsextracted
Citation Jin, JRoth, BFrye, S Functionally selective ligands of dopamine D2 receptors US Patent US9156822 Publication Date 10/13/2015
 
D(2) dopamine receptor
Name:D(2) dopamine receptor
Type:Cell-surface receptors
Mol. Mass.:50647.10
Organism:Homo sapiens (Human)
Description:P14416
Residue:443
BDBM185697
NameBDBM185697
Synonyms:UNC10108018 | US9156822, 41
TypeSmall organic molecule
Emp. Form.C24H30N4O4
Mol. Mass.438.5194
SMILESO=C1CCc2ccc(OCCCCN3CCN(CC3)c3cccc4OCCOc34)nc2N1