Reaction Details
TargetD(3) dopamine receptor
LigandBDBM50395569
Substrate/Competitorn/a
Meas. Tech.Radioligand Binding Assay
pH7.4±n/a
Ki 11±n/a nM
Commentsextracted
Citation Jin, JRoth, BFrye, S Functionally selective ligands of dopamine D2 receptors US Patent US9156822 Publication Date 10/13/2015
 
D(3) dopamine receptor
Name:D(3) dopamine receptor
Type:n/a
Mol. Mass.:44243.43
Organism:Homo sapiens (Human)
Description:n/a
Residue:400
BDBM50395569
NameBDBM50395569
Synonyms:CHEMBL2165119 US9156822, 3 or UNC9975
TypeSmall organic molecule
Emp. Form.C23H28Cl2N4O2
Mol. Mass.463.4
SMILESClc1cccc(N2CCCN(CCCCOc3ccc4CCC(=O)Nc4n3)CC2)c1Cl