Reaction Details
TargetProtein-glutamine gamma-glutamyltransferase 2
LigandBDBM185774
Substrate/Competitorn/a
Meas. Tech.Enzyme Inhibition Assay
IC50>100000±n/a nM
Citation Pardin, CKeillor, JWLubell, WD Cinnamoyl inhibitors of transglutaminase US Patent US9162991 Publication Date 10/20/2015
 
Protein-glutamine gamma-glutamyltransferase 2
Name:Protein-glutamine gamma-glutamyltransferase 2
Type:Enzyme
Mol. Mass.:77122.36
Organism:Cavia cutleri (Guinea pig)
Description:P08587
Residue:690
BDBM185774
NameBDBM185774
Synonyms:US9162991, 15f
TypeSmall organic molecule
Emp. Form.C16H13N3O2
Mol. Mass.279.2933
SMILESCOc1ccccc1\C=C\C(=O)n1nnc2ccccc12