Reaction Details
TargetProtein-glutamine gamma-glutamyltransferase 2
LigandBDBM185781
Substrate/Competitorn/a
Meas. Tech.Enzyme Inhibition Assay
IC50 18000±1000 nM
Citation Pardin, CKeillor, JWLubell, WD Cinnamoyl inhibitors of transglutaminase US Patent US9162991 Publication Date 10/20/2015
 
Protein-glutamine gamma-glutamyltransferase 2
Name:Protein-glutamine gamma-glutamyltransferase 2
Type:Enzyme
Mol. Mass.:77122.36
Organism:Cavia cutleri (Guinea pig)
Description:P08587
Residue:690
BDBM185781
NameBDBM185781
Synonyms:US9162991, 15n
TypeSmall organic molecule
Emp. Form.C16H11BN4O2
Mol. Mass.302.095
SMILESOB(C#N)c1ccc(\C=C\C(=O)n2nnc3ccccc23)cc1