Reaction Details
TargetProtein-glutamine gamma-glutamyltransferase 2
LigandBDBM185784
Substrate/Competitorn/a
Meas. Tech.Enzyme Inhibition Assay
IC50 27000±4000 nM
Citation Pardin, CKeillor, JWLubell, WD Cinnamoyl inhibitors of transglutaminase US Patent US9162991 Publication Date 10/20/2015
 
Protein-glutamine gamma-glutamyltransferase 2
Name:Protein-glutamine gamma-glutamyltransferase 2
Type:Enzyme
Mol. Mass.:77122.36
Organism:Cavia cutleri (Guinea pig)
Description:P08587
Residue:690
BDBM185784
NameBDBM185784
Synonyms:US9162991, 15q
TypeSmall organic molecule
Emp. Form.C17H13N3O3
Mol. Mass.307.3034
SMILESCOC(=O)c1ccc(\C=C\C(=O)n2nnc3ccccc23)cc1