Reaction Details
TargetProtein-glutamine gamma-glutamyltransferase 2
LigandBDBM185771
Substrate/Competitorn/a
Meas. Tech.Enzyme Inhibition Assay
IC50 74000±15000 nM
Citation Pardin, CKeillor, JWLubell, WD Cinnamoyl inhibitors of transglutaminase US Patent US9162991 Publication Date 10/20/2015
 
Protein-glutamine gamma-glutamyltransferase 2
Name:Protein-glutamine gamma-glutamyltransferase 2
Type:Enzyme
Mol. Mass.:77122.36
Organism:Cavia cutleri (Guinea pig)
Description:P08587
Residue:690
BDBM185771
NameBDBM185771
Synonyms:US9162991, 15a
TypeSmall organic molecule
Emp. Form.C15H10N4O3
Mol. Mass.294.2649
SMILESO=C(\C=C\c1ccc(cc1)N(=O)=O)n1nnc2ccccc12