Reaction Details
TargetProtein-glutamine gamma-glutamyltransferase 2
LigandBDBM185789
Substrate/Competitorn/a
Meas. Tech.Enzyme Inhibition Assay
IC50>200000±n/a nM
Citation Pardin, CKeillor, JWLubell, WD Cinnamoyl inhibitors of transglutaminase US Patent US9162991 Publication Date 10/20/2015
 
Protein-glutamine gamma-glutamyltransferase 2
Name:Protein-glutamine gamma-glutamyltransferase 2
Type:Enzyme
Mol. Mass.:77122.36
Organism:Cavia cutleri (Guinea pig)
Description:P08587
Residue:690
BDBM185789
NameBDBM185789
Synonyms:US9162991, 32a
TypeSmall organic molecule
Emp. Form.C14H10N4O4
Mol. Mass.298.2536
SMILESO=C(COc1ccc(cc1)N(=O)=O)n1nnc2ccccc12