Reaction Details
TargetProtein-glutamine gamma-glutamyltransferase 2
LigandBDBM185743
Substrate/Competitorn/a
Meas. Tech.Enzyme Inhibition Assay
IC50>50000±n/a nM
Citation Pardin, CKeillor, JWLubell, WD Cinnamoyl inhibitors of transglutaminase US Patent US9162991 Publication Date 10/20/2015
 
Protein-glutamine gamma-glutamyltransferase 2
Name:Protein-glutamine gamma-glutamyltransferase 2
Type:Enzyme
Mol. Mass.:77122.36
Organism:Cavia cutleri (Guinea pig)
Description:P08587
Residue:690
BDBM185743
NameBDBM185743
Synonyms:US9162991, 19a
TypeSmall organic molecule
Emp. Form.C16H13NO4
Mol. Mass.283.2787
SMILES[O-][N+](=O)c1ccc(\C=C\C(=O)OCc2ccccc2)cc1