Reaction Details
TargetProtein-glutamine gamma-glutamyltransferase 2
LigandBDBM185752
Substrate/Competitorn/a
Meas. Tech.Enzyme Inhibition Assay
IC50 48000±6000 nM
Citation Pardin, CKeillor, JWLubell, WD Cinnamoyl inhibitors of transglutaminase US Patent US9162991 Publication Date 10/20/2015
 
Protein-glutamine gamma-glutamyltransferase 2
Name:Protein-glutamine gamma-glutamyltransferase 2
Type:Enzyme
Mol. Mass.:77122.36
Organism:Cavia cutleri (Guinea pig)
Description:P08587
Residue:690
BDBM185752
NameBDBM185752
Synonyms:US9162991, 28a
TypeSmall organic molecule
Emp. Form.C18H11NO5
Mol. Mass.321.2836
SMILES[O-][N+](=O)c1ccc(\C=C\C(=O)c2cc3ccccc3oc2=O)cc1