Reaction Details
TargetProtein-glutamine gamma-glutamyltransferase 2
LigandBDBM185755
Substrate/Competitorn/a
Meas. Tech.Enzyme Inhibition Assay
IC50 33000±5400 nM
Citation Pardin, CKeillor, JWLubell, WD Cinnamoyl inhibitors of transglutaminase US Patent US9162991 Publication Date 10/20/2015
 
Protein-glutamine gamma-glutamyltransferase 2
Name:Protein-glutamine gamma-glutamyltransferase 2
Type:Enzyme
Mol. Mass.:77122.36
Organism:Cavia cutleri (Guinea pig)
Description:P08587
Residue:690
BDBM185755
NameBDBM185755
Synonyms:US9162991, 4m
TypeSmall organic molecule
Emp. Form.C14H11N7O3
Mol. Mass.325.2822
SMILESO=C(\C=C\c1ccc(cc1)N(=O)=O)c1cn(Cc2cnn[nH]2)nn1