Reaction Details
TargetProtein-glutamine gamma-glutamyltransferase 2
LigandBDBM185764
Substrate/Competitorn/a
Meas. Tech.Enzyme Inhibition Assay
IC50>100000±n/a nM
Citation Pardin, CKeillor, JWLubell, WD Cinnamoyl inhibitors of transglutaminase US Patent US9162991 Publication Date 10/20/2015
 
Protein-glutamine gamma-glutamyltransferase 2
Name:Protein-glutamine gamma-glutamyltransferase 2
Type:Enzyme
Mol. Mass.:77122.36
Organism:Cavia cutleri (Guinea pig)
Description:P08587
Residue:690
BDBM185764
NameBDBM185764
Synonyms:US9162991, 4j
TypeSmall organic molecule
Emp. Form.C20H12F6N4O3
Mol. Mass.470.3247
SMILESFC(F)(F)c1cc(Cn2cc(nn2)C(=O)\C=C\c2ccc(cc2)N(=O)=O)cc(c1)C(F)(F)F