Reaction Details
TargetProtein-glutamine gamma-glutamyltransferase 2
LigandBDBM185765
Substrate/Competitorn/a
Meas. Tech.Enzyme Inhibition Assay
IC50 17000±1500 nM
Citation Pardin, CKeillor, JWLubell, WD Cinnamoyl inhibitors of transglutaminase US Patent US9162991 Publication Date 10/20/2015
 
Protein-glutamine gamma-glutamyltransferase 2
Name:Protein-glutamine gamma-glutamyltransferase 2
Type:Enzyme
Mol. Mass.:77122.36
Organism:Cavia cutleri (Guinea pig)
Description:P08587
Residue:690
BDBM185765
NameBDBM185765
Synonyms:US9162991, 4k
TypeSmall organic molecule
Emp. Form.C19H16N4O3
Mol. Mass.348.3553
SMILESCC(c1ccccc1)n1cc(nn1)C(=O)\C=C\c1ccc(cc1)N(=O)=O