Reaction Details
TargetPoly [ADP-ribose] polymerase tankyrase-1
LigandBDBM185825
Substrate/Competitorn/a
Meas. Tech.Biochemical Assay
Temperature298.15±n/a K
IC50 12±1 nM
Commentsextracted
Citation Chen, CHChin, DNDiPietro, LVFan, JPalermo, MGShultz, MDToure, B 4-piperidinyl compounds for use as tankyrase inhibitors US Patent US9163003 Publication Date 10/20/2015
 
Poly [ADP-ribose] polymerase tankyrase-1
Name:Poly [ADP-ribose] polymerase tankyrase-1
Type:Enzyme
Mol. Mass.:142058.03
Organism:Homo sapiens (Human)
Description:O95271
Residue:1327
BDBM185825
NameBDBM185825
Synonyms:US9163003, 16 | USRE46942, Example 17
TypeSmall organic molecule
Emp. Form.C26H30N4O5
Mol. Mass.478.5402
SMILESCOc1ccc2C(=O)C3(Cc2c1)CCN(CC3)[C@H]1CCN(Cc2nc3CCOCc3c(=O)[nH]2)C1=O