Reaction Details
TargetCell division cycle 7-related protein kinase
LigandBDBM50337330
Substrate/Competitorn/a
Meas. Tech.Inhibition Assay
pH7.5±n/a
Ki 56.3±n/a nM
Commentsextracted
Citation Akritopoulou-Zanze, IWakefield, BDMack, HTurner, SCGasiecki, AFGracias, VJSarris, KAKalvin, DMMichmerhuizen, MJShuai, QPatel, JRBakker, MHTeusch, NJohnson, EFKovar, PJDjuric, SWLong, AJVasudevan, AGeorge, DMWang, LLi, BMoore, NSHobson, ADWoods, KWMiyashiro, JMSwann, Jr., SLPenning, TD 5-substituted indazoles as kinase inhibitors US Patent US9163007 Publication Date 10/20/2015
 
Cell division cycle 7-related protein kinase
Name:Cell division cycle 7-related protein kinase
Type:Protein
Mol. Mass.:63908.16
Organism:Homo sapiens (Human)
Description:O00311
Residue:574
BDBM50337330
NameBDBM50337330
Synonyms:5-(1-(4-fluorobenzyl)-1H-1,2,3-triazol-4-yl)-1H-indazole US9163007, 10
TypeSmall organic molecule
Emp. Form.C16H12FN5
Mol. Mass.293.2984
SMILESFc1ccc(Cn2cc(nn2)-c2ccc3[nH]ncc3c2)cc1