Reaction Details
TargetCell division cycle 7-related protein kinase
LigandBDBM50337315
Substrate/Competitorn/a
Meas. Tech.Inhibition Assay
pH7.5±n/a
Ki 12±n/a nM
Commentsextracted
Citation Akritopoulou-Zanze, IWakefield, BDMack, HTurner, SCGasiecki, AFGracias, VJSarris, KAKalvin, DMMichmerhuizen, MJShuai, QPatel, JRBakker, MHTeusch, NJohnson, EFKovar, PJDjuric, SWLong, AJVasudevan, AGeorge, DMWang, LLi, BMoore, NSHobson, ADWoods, KWMiyashiro, JMSwann, Jr., SLPenning, TD 5-substituted indazoles as kinase inhibitors US Patent US9163007 Publication Date 10/20/2015
 
Cell division cycle 7-related protein kinase
Name:Cell division cycle 7-related protein kinase
Type:Protein
Mol. Mass.:63908.16
Organism:Homo sapiens (Human)
Description:O00311
Residue:574
BDBM50337315
NameBDBM50337315
Synonyms:5-(1-benzyl-1H-1,2,3-triazol-4-yl)-1H-indazol-3-amine US9163007, 62
TypeSmall organic molecule
Emp. Form.C16H14N6
Mol. Mass.290.3226
SMILESNc1n[nH]c2ccc(cc12)-c1cn(Cc2ccccc2)nn1