Reaction Details
TargetCell division cycle 7-related protein kinase
LigandBDBM50388878
Substrate/Competitorn/a
Meas. Tech.Inhibition Assay
pH7.5±n/a
Ki 0.6±n/a nM
Commentsextracted
Citation Akritopoulou-Zanze, IWakefield, BDMack, HTurner, SCGasiecki, AFGracias, VJSarris, KAKalvin, DMMichmerhuizen, MJShuai, QPatel, JRBakker, MHTeusch, NJohnson, EFKovar, PJDjuric, SWLong, AJVasudevan, AGeorge, DMWang, LLi, BMoore, NSHobson, ADWoods, KWMiyashiro, JMSwann, Jr., SLPenning, TD 5-substituted indazoles as kinase inhibitors US Patent US9163007 Publication Date 10/20/2015
 
Cell division cycle 7-related protein kinase
Name:Cell division cycle 7-related protein kinase
Type:Protein
Mol. Mass.:63908.16
Organism:Homo sapiens (Human)
Description:O00311
Residue:574
BDBM50388878
NameBDBM50388878
Synonyms:CHEMBL1999931 | US9163007, 73
TypeSmall organic molecule
Emp. Form.C23H18N6O
Mol. Mass.394.4286
SMILESO=C(Nc1n[nH]c2ccc(cc12)-c1cn(Cc2ccccc2)nn1)c1ccccc1