Reaction Details
TargetCell division cycle 7-related protein kinase
LigandBDBM185878
Substrate/Competitorn/a
Meas. Tech.Inhibition Assay
pH7.5±n/a
Ki 22±n/a nM
Commentsextracted
Citation Akritopoulou-Zanze, IWakefield, BDMack, HTurner, SCGasiecki, AFGracias, VJSarris, KAKalvin, DMMichmerhuizen, MJShuai, QPatel, JRBakker, MHTeusch, NJohnson, EFKovar, PJDjuric, SWLong, AJVasudevan, AGeorge, DMWang, LLi, BMoore, NSHobson, ADWoods, KWMiyashiro, JMSwann, Jr., SLPenning, TD 5-substituted indazoles as kinase inhibitors US Patent US9163007 Publication Date 10/20/2015
 
Cell division cycle 7-related protein kinase
Name:Cell division cycle 7-related protein kinase
Type:Protein
Mol. Mass.:63908.16
Organism:Homo sapiens (Human)
Description:O00311
Residue:574
BDBM185878
NameBDBM185878
Synonyms:US9163007, 263
TypeSmall organic molecule
Emp. Form.C26H22ClN7O
Mol. Mass.483.952
SMILESNC(=O)N(c1n[nH]c2ccc(cc12)-c1nnn(Cc2ccccc2)c1C1CC1)c1ccccc1Cl