Reaction Details
TargetSodium channel protein type 9 subunit alpha
LigandBDBM185953
Substrate/Competitorn/a
Meas. Tech.Electrophysiology Assay
pH7.4±n/a
Ki 24±n/a nM
Commentsextracted
Citation Ni, CShao, BTafesse, LYao, JYoungman, MPark, M Pyrimidines as sodium channel blockers US Patent US9163008 Publication Date 10/20/2015
 
Sodium channel protein type 9 subunit alpha
Name:Sodium channel protein type 9 subunit alpha
Type:Protein
Mol. Mass.:226375.97
Organism:Homo sapiens (Human)
Description:Q15858
Residue:1988
BDBM185953
NameBDBM185953
Synonyms:US9163008, 42 | US9656968, Compound 42
TypeSmall organic molecule
Emp. Form.C20H19FN4O3
Mol. Mass.382.3883
SMILESC[C@@H](CO)Nc1cc(nc(n1)-c1ccc(Oc2ccc(F)cc2)cc1)C(N)=O