Reaction Details
TargetVoltage-dependent calcium channel gamma-8 subunit
LigandBDBM288218
Substrate/Competitorn/a
Meas. Tech.Calcium Flux Assay
pH7.4±n/a
IC50 0.079±n/a nM
Commentsextracted
Citation Ameriks, MKGyuris, MLaforteza, BNLebold, TPMeyer, STRavula, SSavall, BMShireman, BTWade, WSGerencsér, J Fused bicylic pyridine compounds and their use as AMPA receptor modulators US Patent US10087185 Publication Date 10/2/2018
 
Voltage-dependent calcium channel gamma-8 subunit
Name:Voltage-dependent calcium channel gamma-8 subunit
Type:Enzyme Catalytic Domain
Mol. Mass.:43326.96
Organism:Homo sapiens (Human)
Description:Q8WXS5
Residue:425
BDBM288218
NameBDBM288218
Synonyms:5-(7-Chloro-1H-indazol-5-yl)-2-isopropyl-6-(trifluoromethyl)- | US10087185, Example 36
TypeSmall organic molecule
Emp. Form.C17H13ClF3N5
Mol. Mass.379.767
SMILESCC(C)c1nc2ccc(c(-c3cc(Cl)c4[nH]ncc4c3)n2n1)C(F)(F)F