Reaction Details
TargetVoltage-dependent calcium channel gamma-8 subunit
LigandBDBM288235
Substrate/Competitorn/a
Meas. Tech.Calcium Flux Assay
pH7.4±n/a
IC50 0.050±n/a nM
Commentsextracted
Citation Ameriks, MKGyuris, MLaforteza, BNLebold, TPMeyer, STRavula, SSavall, BMShireman, BTWade, WSGerencsér, J Fused bicylic pyridine compounds and their use as AMPA receptor modulators US Patent US10087185 Publication Date 10/2/2018
 
Voltage-dependent calcium channel gamma-8 subunit
Name:Voltage-dependent calcium channel gamma-8 subunit
Type:Enzyme Catalytic Domain
Mol. Mass.:43326.96
Organism:Homo sapiens (Human)
Description:Q8WXS5
Residue:425
BDBM288235
NameBDBM288235
Synonyms:5-(7-Chloro-1H-indazol-5-yl)-6-(1,1-difluoroethyl)-2- | US10087185, Example 53
TypeSmall organic molecule
Emp. Form.C16H9ClF5N5
Mol. Mass.401.721
SMILESCC(F)(F)c1ccc2nc(nn2c1-c1cc(Cl)c2[nH]ncc2c1)C(F)(F)F