Reaction Details
TargetVoltage-dependent calcium channel gamma-8 subunit
LigandBDBM288239
Substrate/Competitorn/a
Meas. Tech.Calcium Flux Assay
pH7.4±n/a
IC50 0.063±n/a nM
Commentsextracted
Citation Ameriks, MKGyuris, MLaforteza, BNLebold, TPMeyer, STRavula, SSavall, BMShireman, BTWade, WSGerencsér, J Fused bicylic pyridine compounds and their use as AMPA receptor modulators US Patent US10087185 Publication Date 10/2/2018
 
Voltage-dependent calcium channel gamma-8 subunit
Name:Voltage-dependent calcium channel gamma-8 subunit
Type:Enzyme Catalytic Domain
Mol. Mass.:43326.96
Organism:Homo sapiens (Human)
Description:Q8WXS5
Residue:425
BDBM288239
NameBDBM288239
Synonyms:5-(6-(4-Fluorophenyl)-2-(trifluoromethyl)-[1,2,4]triazolo[1,5- | US10087185, Example 57
TypeSmall organic molecule
Emp. Form.C22H14F4N4O
Mol. Mass.426.3664
SMILESCc1cc(cc2CC(=O)Nc12)-c1c(ccc2nc(nn12)C(F)(F)F)-c1ccc(F)cc1