Reaction Details
TargetVoltage-dependent calcium channel gamma-8 subunit
LigandBDBM288304
Substrate/Competitorn/a
Meas. Tech.Calcium Flux Assay
pH7.4±n/a
IC50 0.050±n/a nM
Commentsextracted
Citation Ameriks, MKGyuris, MLaforteza, BNLebold, TPMeyer, STRavula, SSavall, BMShireman, BTWade, WSGerencsér, J Fused bicylic pyridine compounds and their use as AMPA receptor modulators US Patent US10087185 Publication Date 10/2/2018
 
Voltage-dependent calcium channel gamma-8 subunit
Name:Voltage-dependent calcium channel gamma-8 subunit
Type:Enzyme Catalytic Domain
Mol. Mass.:43326.96
Organism:Homo sapiens (Human)
Description:Q8WXS5
Residue:425
BDBM288304
NameBDBM288304
Synonyms:5-[6-(Difluoromethyl)-4-methyl-2-(trifluoromethyl)pyrazolo[1,5- | US10087185, Example 122
TypeSmall organic molecule
Emp. Form.C19H14F5N3O
Mol. Mass.395.326
SMILESCc1cc(cc2CC(=O)Nc12)-c1c(cc(C)c2cc(nn12)C(F)(F)F)C(F)F