Reaction Details
TargetPhosphatidylinositol 4-phosphate 3-kinase C2 domain-containing subunit beta
LigandBDBM288321
Substrate/Competitorn/a
Meas. Tech.KINOMEscan Enzyme Binding Assays
Kd 1.50±n/a nM
Citation Mevellec, LAMeerpoel, LCoupa, SPoncelet, VSPilatte, INPasquier, ETBerthelot, DJQuerolle, OAMeyer, CAngibaud, PRDemestre, CGMercey, GJ Imidazopyridazine derivatives as PI3KB inhibitors US Patent US10087187 Publication Date 10/2/2018
 
Phosphatidylinositol 4-phosphate 3-kinase C2 domain-containing subunit beta
Name:Phosphatidylinositol 4-phosphate 3-kinase C2 domain-containing subunit beta
Type:Enzyme
Mol. Mass.:184784.86
Organism:Homo sapiens (Human)
Description:O00750
Residue:1634
BDBM288321
NameBDBM288321
Synonyms:US10087187, Compound 14 US10087187, Compound 14b | US10087187, Compound 14c
TypeSmall organic molecule
Emp. Form.C20H22F3N5O2
Mol. Mass.421.4162
SMILESCc1c(Cc2c(CO)nc3c(N)cc(nn23)N2CCOCC2)cccc1C(F)(F)F