Reaction Details
TargetPhosphatidylinositol 4-phosphate 3-kinase C2 domain-containing subunit beta
LigandBDBM288381
Substrate/Competitorn/a
Meas. Tech.KINOMEscan Enzyme Binding Assays
Kd 1.40±n/a nM
Citation Mevellec, LAMeerpoel, LCoupa, SPoncelet, VSPilatte, INPasquier, ETBerthelot, DJQuerolle, OAMeyer, CAngibaud, PRDemestre, CGMercey, GJ Imidazopyridazine derivatives as PI3KB inhibitors US Patent US10087187 Publication Date 10/2/2018
 
Phosphatidylinositol 4-phosphate 3-kinase C2 domain-containing subunit beta
Name:Phosphatidylinositol 4-phosphate 3-kinase C2 domain-containing subunit beta
Type:Enzyme
Mol. Mass.:184784.86
Organism:Homo sapiens (Human)
Description:O00750
Residue:1634
BDBM288381
NameBDBM288381
Synonyms:US10087187, Compound 74 US10087187, Compound 78
TypeSmall organic molecule
Emp. Form.C23H28F3N7O2
Mol. Mass.491.5093
SMILESCc1nc2c(N)cc(nn2c1Nc1cccc(c1CN1CCC(O)C1)C(F)(F)F)N1CCOCC1