Reaction Details
TargetPhosphatidylinositol 4-phosphate 3-kinase C2 domain-containing subunit alpha
LigandBDBM288396
Substrate/Competitorn/a
Meas. Tech.KINOMEscan Enzyme Binding Assays
Kd>30200±n/a nM
Citation Mevellec, LAMeerpoel, LCoupa, SPoncelet, VSPilatte, INPasquier, ETBerthelot, DJQuerolle, OAMeyer, CAngibaud, PRDemestre, CGMercey, GJ Imidazopyridazine derivatives as PI3KB inhibitors US Patent US10087187 Publication Date 10/2/2018
 
Phosphatidylinositol 4-phosphate 3-kinase C2 domain-containing subunit alpha
Name:Phosphatidylinositol 4-phosphate 3-kinase C2 domain-containing subunit alpha
Type:Protein
Mol. Mass.:190704.50
Organism:Homo sapiens (Human)
Description:O00443
Residue:1686
BDBM288396
NameBDBM288396
Synonyms:US10087187, Compound 93
TypeSmall organic molecule
Emp. Form.C19H22FN5O2
Mol. Mass.371.4087
SMILESCc1c(F)cccc1Cc1c(CO)nc2c(N)cc(nn12)N1CCOCC1