Reaction Details
TargetDihydrolipoyl dehydrogenase
LigandBDBM119877
Substrate/Competitorn/a
Meas. Tech.Inhibition Assay
pH7±n/a
IC50 840±130 nM
Commentsextracted
Citation Wong, CWu, Y Compounds and methods for treating tuberculosis infection US Patent US9073941 Publication Date 7/7/2015
 
Dihydrolipoyl dehydrogenase
Name:Dihydrolipoyl dehydrogenase
Type:Enzyme
Mol. Mass.:49231.98
Organism:Mycobacterium tuberculosis
Description:P9WHH9
Residue:464
BDBM119877
NameBDBM119877
Synonyms:SL809 | US9073941, 502
TypeSmall organic molecule
Emp. Form.C16H19BrN4O5S
Mol. Mass.459.315
SMILESCOc1ccc(NC(=O)CN(C)S(=O)(=O)c2cc(Br)cnc2N)cc1OC