Reaction Details
TargetDihydrolipoyl dehydrogenase
LigandBDBM36527
Substrate/Competitorn/a
Meas. Tech.Inhibition Assay
pH7±n/a
IC50<40±n/a nM
Commentsextracted
Citation Wong, CWu, Y Compounds and methods for treating tuberculosis infection US Patent US9073941 Publication Date 7/7/2015
 
Dihydrolipoyl dehydrogenase
Name:Dihydrolipoyl dehydrogenase
Type:Enzyme
Mol. Mass.:49231.98
Organism:Mycobacterium tuberculosis
Description:P9WHH9
Residue:464
BDBM36527
NameBDBM36527
Synonyms:1,6-dimethyl-3-phenyl-1H,5H,6H,7H-pyrimido[5,4-e][1,2,4]triazine-5,7-dione, 10 | US9073941, 601
TypeSmall organic molecule
Emp. Form.C13H11N5O2
Mol. Mass.269.2587
SMILESCn1nc(nc2c1nc(=O)n(C)c2=O)-c1ccccc1