Reaction Details
TargetDihydrolipoyl dehydrogenase
LigandBDBM188291
Substrate/Competitorn/a
Meas. Tech.Inhibition Assay
pH7±n/a
IC50<40±n/a nM
Commentsextracted
Citation Wong, CWu, Y Compounds and methods for treating tuberculosis infection US Patent US9073941 Publication Date 7/7/2015
 
Dihydrolipoyl dehydrogenase
Name:Dihydrolipoyl dehydrogenase
Type:Enzyme
Mol. Mass.:49231.98
Organism:Mycobacterium tuberculosis
Description:P9WHH9
Residue:464
BDBM188291
NameBDBM188291
Synonyms:US9073941, 616
TypeSmall organic molecule
Emp. Form.C13H10FN5O2
Mol. Mass.287.2492
SMILESCn1nc(nc2c1nc(=O)n(C)c2=O)-c1ccc(F)cc1