Reaction Details
TargetDihydrolipoyl dehydrogenase
LigandBDBM188303
Substrate/Competitorn/a
Meas. Tech.Inhibition Assay
pH7±n/a
IC50 860±80 nM
Commentsextracted
Citation Wong, CWu, Y Compounds and methods for treating tuberculosis infection US Patent US9073941 Publication Date 7/7/2015
 
Dihydrolipoyl dehydrogenase
Name:Dihydrolipoyl dehydrogenase
Type:Enzyme
Mol. Mass.:49231.98
Organism:Mycobacterium tuberculosis
Description:P9WHH9
Residue:464
BDBM188303
NameBDBM188303
Synonyms:US9073941, 903
TypeSmall organic molecule
Emp. Form.C14H11NO3
Mol. Mass.241.242
SMILESCC1(C)C2C(=NC1=O)c1ccccc1C(=O)C2=O