Reaction Details
TargetDihydrolipoyl dehydrogenase
LigandBDBM188304
Substrate/Competitorn/a
Meas. Tech.Inhibition Assay
pH7±n/a
IC50<40±n/a nM
Commentsextracted
Citation Wong, CWu, Y Compounds and methods for treating tuberculosis infection US Patent US9073941 Publication Date 7/7/2015
 
Dihydrolipoyl dehydrogenase
Name:Dihydrolipoyl dehydrogenase
Type:Enzyme
Mol. Mass.:49231.98
Organism:Mycobacterium tuberculosis
Description:P9WHH9
Residue:464
BDBM188304
NameBDBM188304
Synonyms:US9073941, 905
TypeSmall organic molecule
Emp. Form.C16H9N3O2
Mol. Mass.275.2616
SMILESO=C1c2nn(nc2-c2ccccc2C1=O)-c1ccccc1