Reaction Details
TargetDihydrolipoyl dehydrogenase
LigandBDBM34697
Substrate/Competitorn/a
Meas. Tech.Inhibition Assay
pH7±n/a
IC50 870±100 nM
Commentsextracted
Citation Wong, CWu, Y Compounds and methods for treating tuberculosis infection US Patent US9073941 Publication Date 7/7/2015
 
Dihydrolipoyl dehydrogenase
Name:Dihydrolipoyl dehydrogenase
Type:Enzyme
Mol. Mass.:49231.98
Organism:Mycobacterium tuberculosis
Description:P9WHH9
Residue:464
BDBM34697
NameBDBM34697
Synonyms:MLS000569396 N-(1-butan-2-yl-3-cyano-pyrrolo[3,2-b]quinoxalin-2-yl)benzamide N-(3-cyano-1-sec-butyl-pyrrolo[3,2-b]quinoxalin-2-yl)benzamide US9073941, 1004 | cid_4101144
TypeSmall organic molecule
Emp. Form.C22H19N5O
Mol. Mass.369.4192
SMILESCCC(C)n1c(NC(=O)c2ccccc2)c(C#N)c2nc3ccccc3nc12