Reaction Details
TargetDihydrolipoyl dehydrogenase
LigandBDBM188308
Substrate/Competitorn/a
Meas. Tech.Inhibition Assay
pH7±n/a
IC50 900±130 nM
Commentsextracted
Citation Wong, CWu, Y Compounds and methods for treating tuberculosis infection US Patent US9073941 Publication Date 7/7/2015
 
Dihydrolipoyl dehydrogenase
Name:Dihydrolipoyl dehydrogenase
Type:Enzyme
Mol. Mass.:49231.98
Organism:Mycobacterium tuberculosis
Description:P9WHH9
Residue:464
BDBM188308
NameBDBM188308
Synonyms:US9073941, 1005
TypeSmall organic molecule
Emp. Form.C22H21N5O2S
Mol. Mass.419.499
SMILESCCCCn1c(NS(=O)(=O)c2ccc(C)cc2)c(C#N)c2nc3ccccc3nc12