Reaction Details
Target5-hydroxytryptamine receptor 1D
LigandBDBM186935
Substrate/Competitorn/a
Meas. Tech.Radioligand Binding Assay
pH7.4±n/a
Ki 1121±n/a nM
Commentsextracted
Citation Besnard, JHopkins, ALGilbert, IRuda, GFAbecassis, K Morpholino compounds, uses and methods US Patent US9079895 Publication Date 7/14/2015
 
5-hydroxytryptamine receptor 1D
Name:5-hydroxytryptamine receptor 1D
Type:Enzyme
Mol. Mass.:41605.88
Organism:Mus musculus (Mouse)
Description:Q61224
Residue:374
BDBM186935
NameBDBM186935
Synonyms:US9079895, 23s
TypeSmall organic molecule
Emp. Form.C21H25ClN2O2
Mol. Mass.372.888
SMILESClc1cccc(OC[C@@H]2CN(CCN3CCc4ccccc34)CCO2)c1