Reaction Details
Target5-hydroxytryptamine receptor 1D
LigandBDBM186937
Substrate/Competitorn/a
Meas. Tech.Radioligand Binding Assay
pH7.4±n/a
Ki 1976±n/a nM
Commentsextracted
Citation Besnard, JHopkins, ALGilbert, IRuda, GFAbecassis, K Morpholino compounds, uses and methods US Patent US9079895 Publication Date 7/14/2015
 
5-hydroxytryptamine receptor 1D
Name:5-hydroxytryptamine receptor 1D
Type:Enzyme
Mol. Mass.:41605.88
Organism:Mus musculus (Mouse)
Description:Q61224
Residue:374
BDBM186937
NameBDBM186937
Synonyms:US9079895, 25s
TypeSmall organic molecule
Emp. Form.C22H28N2O3
Mol. Mass.368.4693
SMILESCOc1cccc(OC[C@@H]2CN(CCN3CCc4ccccc34)CCO2)c1