Reaction Details
TargetD(4) dopamine receptor
LigandBDBM186935
Substrate/Competitorn/a
Meas. Tech.Radioligand Binding Assay
pH7.4±n/a
Ki 146±n/a nM
Commentsextracted
Citation Besnard, JHopkins, ALGilbert, IRuda, GFAbecassis, K Morpholino compounds, uses and methods US Patent US9079895 Publication Date 7/14/2015
 
D(4) dopamine receptor
Name:D(4) dopamine receptor
Type:Enzyme
Mol. Mass.:41498.73
Organism:Mus musculus (Mouse)
Description:P51436
Residue:387
BDBM186935
NameBDBM186935
Synonyms:US9079895, 23s
TypeSmall organic molecule
Emp. Form.C21H25ClN2O2
Mol. Mass.372.888
SMILESClc1cccc(OC[C@@H]2CN(CCN3CCc4ccccc34)CCO2)c1