Reaction Details
TargetNicotinamide phosphoribosyltransferase
LigandBDBM186981
Substrate/Competitorn/a
Meas. Tech.Biochemical Inhibition Assay
pH7.5±n/a
Temperature298.15±n/a K
IC50 1.4±n/a nM
Commentsextracted
Citation Bair, KWBaumeister, TBuckmelter, AJClodfelter, KHHan, BLin, JReynolds, DJSmith, CCWang, ZZheng, X Compounds and compositions for the inhibition of NAMPT US Patent US9169209 Publication Date 10/27/2015
 
Nicotinamide phosphoribosyltransferase
Name:Nicotinamide phosphoribosyltransferase
Type:Enzyme
Mol. Mass.:55524.98
Organism:Homo sapiens (Human)
Description:P43490
Residue:491
BDBM186981
NameBDBM186981
Synonyms:US9169209, Table 3, Compound 12
TypeSmall organic molecule
Emp. Form.C23H22N4O3S
Mol. Mass.434.511
SMILESO=C(Nc1ccc(cc1)S(=O)(=O)c1cncc(c1)N1CCCC1)\C=C\c1cccnc1