Reaction Details
TargetRAC-alpha serine/threonine-protein kinase
LigandBDBM187363
Substrate/Competitorn/a
Meas. Tech.Time-Resolved Fluorescence Resonance energy transfer (TR-FRET) Immunoassay
IC50 0.4±n/a nM
Citation Notte, G Apoptosis signal-regulating kinase inhibitors US Patent US9169243 Publication Date 10/27/2015
 
RAC-alpha serine/threonine-protein kinase
Name:RAC-alpha serine/threonine-protein kinase
Type:Enzyme
Mol. Mass.:55681.25
Organism:Homo sapiens (Human)
Description:P31749
Residue:480
BDBM187363
NameBDBM187363
Synonyms:US9169243, 11 | US9908875, 11
TypeSmall organic molecule
Emp. Form.C27H30N10O2S
Mol. Mass.558.658
SMILESCNC(=O)C1CCN(CC1)c1cnc(cc1-n1cnc(c1)C1CC1)C(=O)Nc1csc(n1)-c1nncn1C1CC1