Reaction Details
TargetKappa-type opioid receptor
LigandBDBM156570
Substrate/Competitorn/a
Meas. Tech.OPRK1 antagonist assay
Temperature298.15±n/a K
IC50 0.97±n/a nM
Commentsextracted
Citation Roberts, EGuerrero, MAUrbano, MRosen, H Kappa opioid ligands US Patent US9682966 Publication Date 6/20/2017
 
Kappa-type opioid receptor
Name:Kappa-type opioid receptor
Type:G Protein-Coupled Receptor (GPCR)
Mol. Mass.:42648.76
Organism:Homo sapiens (Human)
Description:P41145
Residue:380
BDBM156570
NameBDBM156570
Synonyms:US10118915, Compound 350 | US9682966, 350
TypeSmall organic molecule
Emp. Form.C25H33N5O
Mol. Mass.419.5624
SMILESCC1CCC(CC1)NC1CCN(CC1)c1nc2ccc(C)cc2cc1-c1nc(C)no1