Reaction Details
TargetTyrosine-protein kinase BTK
LigandBDBM255336
Substrate/Competitorn/a
Meas. Tech.Btk Enzyme Activity Assay
IC50 0.410±n/a nM
Citation Liu, JKozlowski, JAAlhassan, ABoga, SBGao, XGuiadeen, DGWang, JYu, WCai, JLiu, SWang, DWu, HYang, C Benzamide imidazopyrazine Btk inhibitors US Patent US10087188 Publication Date 10/2/2018
 
Tyrosine-protein kinase BTK
Name:Tyrosine-protein kinase BTK
Type:Enzyme
Mol. Mass.:76289.95
Organism:Homo sapiens (Human)
Description:Q06187
Residue:659
BDBM255336
NameBDBM255336
Synonyms:US10087188, Example 43 | US9481682, 86
TypeSmall organic molecule
Emp. Form.C31H31F3N8O4
Mol. Mass.636.6242
SMILESCC(C)(N1C[C@@H]2CC[C@H](CN2C(=O)C1)c1nc(-c2ccc(cc2)C(=O)Nc2cc(ccn2)C(F)(F)F)c2c(N)nccn12)C(O)=O