Reaction Details
TargetTyrosine-protein kinase BTK
LigandBDBM288518
Substrate/Competitorn/a
Meas. Tech.Btk Enzyme Activity Assay
IC50 0.340±n/a nM
Citation Liu, JKozlowski, JAAlhassan, ABoga, SBGao, XGuiadeen, DGWang, JYu, WCai, JLiu, SWang, DWu, HYang, C Benzamide imidazopyrazine Btk inhibitors US Patent US10087188 Publication Date 10/2/2018
 
Tyrosine-protein kinase BTK
Name:Tyrosine-protein kinase BTK
Type:Enzyme
Mol. Mass.:76289.95
Organism:Homo sapiens (Human)
Description:Q06187
Residue:659
BDBM288518
NameBDBM288518
Synonyms:(1R,3R,5S,6r)-3-[8- amino-1-(4-{[4- (trifluoromethyl) pyridin-2- yl]carbamoyl}phenyl) imidazo[1,5-a]pyrazin- 3- yl]bicyclo[3.1.0]hexane- 6-carboxylic acid | US10087188, Example 125
TypeSmall organic molecule
Emp. Form.C26H21F3N6O3
Mol. Mass.522.4785
SMILESNc1nccn2c(nc(-c3ccc(cc3)C(=O)Nc3cc(ccn3)C(F)(F)F)c12)[C@H]1C[C@H]2[C@@H](C1)[C@@H]2C(O)=O