Reaction Details
TargetTyrosine-protein kinase BTK
LigandBDBM288561
Substrate/Competitorn/a
Meas. Tech.Btk Enzyme Activity Assay
IC50 0.190±n/a nM
Citation Liu, JKozlowski, JAAlhassan, ABoga, SBGao, XGuiadeen, DGWang, JYu, WCai, JLiu, SWang, DWu, HYang, C Benzamide imidazopyrazine Btk inhibitors US Patent US10087188 Publication Date 10/2/2018
 
Tyrosine-protein kinase BTK
Name:Tyrosine-protein kinase BTK
Type:Enzyme
Mol. Mass.:76289.95
Organism:Homo sapiens (Human)
Description:Q06187
Residue:659
BDBM288561
NameBDBM288561
Synonyms:4-(8-amino-1-{4-[(4- cyclopropylpyridin-2- yl)carbamoyl]phenyl} imidazo[1,5-a]pyrazin- 3- yl)bicyclo[2.2.2] octane-1-carboxylic acid | US10087188, Example 169
TypeSmall organic molecule
Emp. Form.C30H30N6O3
Mol. Mass.522.5976
SMILESNc1nccn2c(nc(-c3ccc(cc3)C(=O)Nc3cc(ccn3)C3CC3)c12)C12CCC(CC1)(CC2)C(O)=O