Reaction Details
TargetTyrosine-protein kinase BTK
LigandBDBM288563
Substrate/Competitorn/a
Meas. Tech.Btk Enzyme Activity Assay
IC50 0.290±n/a nM
Citation Liu, JKozlowski, JAAlhassan, ABoga, SBGao, XGuiadeen, DGWang, JYu, WCai, JLiu, SWang, DWu, HYang, C Benzamide imidazopyrazine Btk inhibitors US Patent US10087188 Publication Date 10/2/2018
 
Tyrosine-protein kinase BTK
Name:Tyrosine-protein kinase BTK
Type:Enzyme
Mol. Mass.:76289.95
Organism:Homo sapiens (Human)
Description:Q06187
Residue:659
BDBM288563
NameBDBM288563
Synonyms:4-[8-amino-1-(2- methoxy-4-{[4- (trifluoromethyl) pyridin-2- yl]carbamoyl}phenyl) imidazo[1,5-a]pyrazin- 3- yl]bicyclo[2.2.2] octane-1-carboxylic acid | US10087188, Example 171
TypeSmall organic molecule
Emp. Form.C29H27F3N6O4
Mol. Mass.580.5577
SMILESCOc1cc(ccc1-c1nc(n2ccnc(N)c12)C12CCC(CC1)(CC2)C(O)=O)C(=O)Nc1cc(ccn1)C(F)(F)F