Reaction Details
TargetInterleukin-1 receptor-associated kinase 4
LigandBDBM187893
Substrate/Competitorn/a
Meas. Tech.Inhibition Assay
pH7.2±n/a
Temperature298.15±n/a K
IC50 1.5±n/a nM
Commentsextracted
Citation Santella, JBKumar, SRDuncia, JVGardner, DSPaidi, VRNair, SKHynes, JWu, HMurugesan, NSarkunam, KArunachalam, P Heteroaryl substituted nicotinamide compounds US Patent US9169252 Publication Date 10/27/2015
 
Interleukin-1 receptor-associated kinase 4
Name:Interleukin-1 receptor-associated kinase 4
Type:Protein
Mol. Mass.:51519.08
Organism:Homo sapiens (Human)
Description:Q9NWZ3
Residue:460
BDBM187893
NameBDBM187893
Synonyms:US9169252, 434 | US9169252, 442
TypeSmall organic molecule
Emp. Form.C23H27FN6O2
Mol. Mass.438.4979
SMILESCOC(C)(C)[C@H](F)CNC(=O)c1cnc(cc1NC(C)C)-n1ccc2cc(cnc12)C#N