Reaction Details
TargetInterleukin-1 receptor-associated kinase 4
LigandBDBM187464
Substrate/Competitorn/a
Meas. Tech.Inhibition Assay
pH7.2±n/a
IC50 1.5±n/a nM
Citation Santella, JBKumar, SRDuncia, JVGardner, DSPaidi, VRNair, SKHynes, JWu, HMurugesan, NSarkunam, KArunachalam, P Heteroaryl substituted nicotinamide compounds US Patent US9169252 Publication Date 10/27/2015
 
Interleukin-1 receptor-associated kinase 4
Name:Interleukin-1 receptor-associated kinase 4
Type:Protein
Mol. Mass.:51519.08
Organism:Homo sapiens (Human)
Description:Q9NWZ3
Residue:460
BDBM187464
NameBDBM187464
Synonyms:US9169252, 65
TypeSmall organic molecule
Emp. Form.C24H26F2N6O2
Mol. Mass.468.499
SMILESCC(C)(O)[C@H](F)CNC(=O)c1cnc(cc1NCC1(F)CCC1)-n1ccc2cc(cnc12)C#N