Reaction Details
TargetInterleukin-1 receptor-associated kinase 4
LigandBDBM187468
Substrate/Competitorn/a
Meas. Tech.Inhibition Assay
pH7.2±n/a
IC50 1.3±n/a nM
Citation Santella, JBKumar, SRDuncia, JVGardner, DSPaidi, VRNair, SKHynes, JWu, HMurugesan, NSarkunam, KArunachalam, P Heteroaryl substituted nicotinamide compounds US Patent US9169252 Publication Date 10/27/2015
 
Interleukin-1 receptor-associated kinase 4
Name:Interleukin-1 receptor-associated kinase 4
Type:Protein
Mol. Mass.:51519.08
Organism:Homo sapiens (Human)
Description:Q9NWZ3
Residue:460
BDBM187468
NameBDBM187468
Synonyms:US9169252, 69
TypeSmall organic molecule
Emp. Form.C27H25FN10O2
Mol. Mass.540.5516
SMILESCn1nnnc1-c1ccc(Nc2cc(ncc2C(=O)NC[C@@H](F)C(C)(C)O)-n2ccc3cc(cnc23)C#N)cc1