Reaction Details
TargetInterleukin-1 receptor-associated kinase 4
LigandBDBM188106
Substrate/Competitorn/a
Meas. Tech.Inhibition Assay
pH7.2±n/a
IC50 1.5±n/a nM
Citation Santella, JBKumar, SRDuncia, JVGardner, DSPaidi, VRNair, SKHynes, JWu, HMurugesan, NSarkunam, KArunachalam, P Heteroaryl substituted nicotinamide compounds US Patent US9169252 Publication Date 10/27/2015
 
Interleukin-1 receptor-associated kinase 4
Name:Interleukin-1 receptor-associated kinase 4
Type:Protein
Mol. Mass.:51519.08
Organism:Homo sapiens (Human)
Description:Q9NWZ3
Residue:460
BDBM188106
NameBDBM188106
Synonyms:US9169252, 637
TypeSmall organic molecule
Emp. Form.C23H25FN8O2
Mol. Mass.464.4954
SMILESCC(C)(O)[C@H](F)CNC(=O)c1cnc(cc1NC12CC(C1)C2)-n1ncc2cc(C#N)c(N)nc12