Reaction Details
TargetPantothenate kinase
LigandBDBM188496
Substrate/Competitorn/a
Meas. Tech.Biochemical Assay (ATP at Km)
IC50 5.5e+2±n/a nM
Citation Björkelid, CBergfors, TRaichurkar, AKMukherjee, KMalolanarasimhan, KBandodkar, BJones, TA Structural and biochemical characterization of compounds inhibiting Mycobacterium tuberculosis pantothenate kinase. J Biol Chem288:18260-70 (2013) 
 
Pantothenate kinase
Name:Pantothenate kinase
Type:Protein
Mol. Mass.:35661.98
Organism:Mycobacterium tuberculosis ATCC 25618/H37Rv
Description:n/a
Residue:312
BDBM188496
NameBDBM188496
Synonyms:Biaryl 2b
TypeSmall organic molecule
Emp. Form.C25H25N5O2
Mol. Mass.427.4983
SMILESNC(=O)COc1ccc(c(CN2CCN(CC2)c2ccccn2)c1)-c1ccc(cc1)C#N