Reaction Details
TargetGag-Pol polyprotein
LigandBDBM50011132
Substrate/Competitorn/a
Meas. Tech.Strand Trasnfer Assay
IC50 4e+2± 9e+1 nM
Citation Feng, LSharma, ASlaughter, AJena, NKoh, YShkriabai, NLarue, RCPatel, PAMitsuya, HKessl, JJEngelman, AFuchs, JRKvaratskhelia, M The A128T resistance mutation reveals aberrant protein multimerization as the primary mechanism of action of allosteric HIV-1 integrase inhibitors. J Biol Chem288:15813-20 (2013) 
 
Gag-Pol polyprotein
Name:Gag-Pol polyprotein
Type:Protein
Mol. Mass.:161820.05
Organism:Human immunodeficiency virus type 1 group M subtype B (isolate NY5) (HIV-1)
Description:P12497
Residue:1435
BDBM50011132
NameBDBM50011132
Synonyms:ALLINI-1 | CHEMBL3259891
TypeSmall organic molecule
Emp. Form.C19H15BrClNO3
Mol. Mass.420.684
SMILESCOC(C(O)=O)c1c(C)nc2ccc(Br)cc2c1-c1ccc(Cl)cc1